Home > Zip File > Error In Opening Zip File During Maven Build

Error In Opening Zip File During Maven Build

Contents

If you've reached this point though, it's likely that the file is irreparably damaged. How can I install a battery kill switch in a 2006 Prius? Then executed mvn install command after deleting. SLF4J: Found binding in [jar:file:/home/hudson/genie.californium/.hudson/maven/slavebundle/lib/maven3-eventspy-runtime.jar!/org/slf4j/impl/StaticLoggerBinder.class] SLF4J: Found binding in [jar:file:/shared/common/apache-maven-latest/lib/slf4j-simple-1.7.5.jar!/org/slf4j/impl/StaticLoggerBinder.class] SLF4J: See http://www.slf4j.org/codes.html#multiple_bindings for an explanation. [DEBUG] Connected to remote [INFO] o.h.m.e.h.SettingsBuildingRequestHandler - Using settings document ID: e23a0b6a-ab36-4ea3-8d97-c6ce7ba3db90 [WARN] o.h.m.e.EventSpyProcessor - navigate to this website

Thank you!! I was essentially running into the same issue because I was using a shared workspace location. more hot questions question feed lang-xml about us tour help blog chat data legal privacy policy work here advertising info mobile contact us feedback Technology Life / Arts Culture / Recreation Try JIRA - bug tracking software for your team. http://stackoverflow.com/questions/10085045/maven-build-failure-cannot-read-zip-file-entry

Error In Opening Zip File During Maven Build

Show SCM/JIRA link daemon added a comment - 2014/Jan/15 8:27 AM Code changed in jenkins User: Jonathan A. disable to backup the archive). This would explain why the traceback complains about the zip file. Atlassian DashboardsProjectsIssuesCaptureGetting started Help JIRA Core help Keyboard Shortcuts About JIRA JIRA Credits Log In Register for Jenkins World Join the Jenkins community at "Jenkins World" in Santa Clara, California from

Switching this to "copyStreamAndClose" should fix this issue. macos mavericks zip share|improve this question edited Jun 23 '14 at 6:02 Ian C.♦ 29.3k19112181 asked Jun 23 '14 at 4:01 user83364 86113 add a comment| 2 Answers 2 active oldest The files are located on the local drive at /var/lib/jenkins/Jenkins Backup/. Error In Opening Zip File Gradle The solution, as suggested, is to delete the jar, then try to download again from the repository (create a maven build with package goal) If that repeatedly fails, the remote location

To set up the debug, Run As->Maven Build , set the Debug output option and specify a goal (e.g. Error In Opening Zip File Jenkins This would explain why restarting the master causes this. more hot questions question feed about us tour help blog chat data legal privacy policy work here advertising info mobile contact us feedback Technology Life / Arts Culture / Recreation Science https://issues.jenkins-ci.org/browse/JENKINS-19752 Open up Terminal.

All of these problems are non-intuitive and the fixes for them are equally non-intuitive and technical. Javac Error In Opening Zip File unzip: cannot find zipfile directory in one of BACKUPSET_2013-10-10_03-00_.zip or BACKUPSET_2013-10-10_03-00_.zip.zip, and cannot find BACKUPSET_2013-10-10_03-00_.zip.ZIP, period. Replacing them solved the problem. A failed build often appends to the jar, but doesn't delete it, therefore producing an unreadable file.

Error In Opening Zip File Jenkins

Are you behind a firewall or proxy ? 3. read this article Hide Permalink Thomas Garcia added a comment - 2016/Dec/15 7:59 PM Brilliant. Error In Opening Zip File During Maven Build In the latter case the central directory and zipfile comment will be found on the last disk(s) of this archive. Error In Opening Zip File Java People Assignee: Unassigned Reporter: David Ishee Votes: 2 Vote for this issue Watchers: 7 Start watching this issue Dates Created: 2015/Jul/13 9:58 PM Updated: 2016/Dec/15 7:59 PM Atlassian JIRA Project Management

Please see attached file Attachments:You must be logged in to view attached files. http://popupjammer.com/zip-file/zip-file-mac.html java.runtime.name=Java(TM) SE Runtime Environment java.runtime.version=1.7.0_45-b18 java.specification.name=Java Platform API Specification java.specification.vendor=Oracle Corporation java.specification.version=1.7 java.vendor=Oracle Corporation java.vendor.url=http://java.oracle.com/ java.vendor.url.bug=http://bugreport.sun.com/bugreport/ java.version=1.7.0_45 java.vm.info=mixed mode java.vm.name=Java HotSpot(TM) 64-Bit Server VM java.vm.specification.name=Java Virtual Machine Specification java.vm.specification.vendor=Oracle Corporation java.vm.specification.version=1.7 For directories with a large number of files, the zip file would be corrupted because an exception was thrown during the process of creating the zip file when the process ran Again, it required manually getting the file myself. Error In Opening Zip File Ant

I couldn't find anything obviously corrupt in my slave.jar file, but I didn't look very hard. Trying the download in the browser sometimes resulted in an IO error (Stack trace attached). Rename the file to .txt before attaching it. 1. http://popupjammer.com/zip-file/can-39-t-unzip-file-mac-error-2.html In the latter case the central directory and zipfile comment will be found on the last disk(s) of this archive.

Because it has attracted low-quality or spam answers that had to be removed, posting an answer now requires 10 reputation on this site (the association bonus does not count). Maven-clean-plugin-2.4.1.jar) Error In Opening Zip File Please share the .log file which is located at /.metadata/.log and send it over to help us investigate further. Hide Permalink M Chon added a comment - 2014/Nov/11 5:24 PM I am also getting this error.

Not sure how long it would've taken me to figure out this was happening.

ls -l /opt/jenkins_backup insgesamt 229336 rw-rr- 1 tomcat tomcat 204881920 Feb 14 12:13 BACKUPSET_2015-02-13_12-00_.zip rw-rr- 1 tomcat tomcat 4915558 Jun 30 12:01 BACKUPSET_2015-06-29_12-00_.zip rw-rr- 1 tomcat tomcat 4952374 Jul 1 12:01 This was crashing my Glassfish 4.0 server (which also had my applications running on it - so it was annoying to find it dead each morning....) I have since wiped out Could this be a potentional issue? ======== Files In Directory ======= rw-rr- 1 jenkins nogroup 8999076933 Aug 9 05:14 BACKUPSET_2013-08-05_09-42_2013-08-08_10-30.zip rw-rr- 1 jenkins nogroup 433132 Oct 10 03:14 BACKUPSET_2013-08-09_03-00_.zip rw-rr- 1 Checksum Validation Failed Maven The -U parameter forces maven to update. –PaoloVictor Sep 29 '11 at 15:55 add a comment| 8 Answers 8 active oldest votes up vote 50 down vote Probably, contents of the

Bought agency bond (FANNIE MAE 0% 04/08/2027), now what? in any way. You could also use the debug setting on a maven run in MyEclipse, which would hopefully give a fuller picture when running from within MyEclipse. get redirected here It happens that artifacts download (both .zip and other formats) fails often when, in office, the network appears slow.

I am using separately download Maven 3.1.1 instead of embedded version. I have some jobs that run on a schedule such as "H/30 * * * *" and they will fail until I manually disconnect the slave and re-launch it. Downloading: http://repo1.maven.org/maven2/net/java/dev/jsr-275/jsr-275/1.0-beta-2/jsr-275-1.0-beta-2.pom [INFO] [compiler:compile] [INFO] Compiling 12 source files to http://buildtest.osgeo.org/osgeo/geonetwork/hudson/job/geonetwork-services-ebrim/org.geonetwork$geonetwork-services-ebrim/ws/target/classes [HUDSON] Archiving http://buildtest.osgeo.org/osgeo/geonetwork/hudson/job/geonetwork-services-ebrim/org.geonetwork$geonetwork-services-ebrim/ws/pom.xml to /home/geonetwork/.hudson/jobs/geonetwork-services-ebrim/modules/org.geonetwork$geonetwork-services-ebrim/builds/2009-02-15_12-03-08/archive/org.geonetwork/geonetwork-services-ebrim/3.0.0/pom.xml [INFO] ------------------------------------------------------------------------ [ERROR] BUILD FAILURE [INFO] ------------------------------------------------------------------------ [INFO] Compilation failure http://buildtest.osgeo.org/osgeo/geonetwork/hudson/job/geonetwork-services-ebrim/org.geonetwork$geonetwork-services-ebrim/ws/src/main/java/org/geonetwork/services/ebrim/csw202/CSW202ServiceImpl.java :[29,-1] cannot access org.geonetwork.search.ebrim.SearchEngine Why can't maven handle that?

This resulted in many leaked file descriptors which would only be cleaned up the next time the garbage collector was run. No, the zip could not be extracted manually, I get the following error: [email protected]:~/Jenkins Backup$ unzip BACKUPSET_2013-10-10_03-00_.zip Archive: BACKUPSET_2013-10-10_03-00_.zip End-of-central-directory signature not found. Something was rather wrong with the zip file. –Federico Dec 14 '15 at 0:57 add a comment| up vote 0 down vote There are a number of things that could have Whereas .tar creates the archive, which you can then zip all at once, at the end.

share|improve this answer answered Jan 4 '12 at 20:31 Darkaico 57658 2 It seems not work,I delete the ./m2/repository folder again and again,but still fail. –janwen Jul 5 '12 at You can access it by typing "Terminal" into Spotlight. Erase tool for polylines with ArcGIS Standard License Why are Stormtroopers stationed outside the Death Star near the turbolaser batteries adjacent to Bay 327? Not the answer you're looking for?

share|improve this answer answered Feb 13 '13 at 13:21 Sonko 1 add a comment| up vote 0 down vote Delete the m2 repository folder and try running your maven ,it will share|improve this answer answered Jun 23 '14 at 5:49 njboot 4,87121242 2 You can also drag-n-drop the file into the terminal window, instead of typing the directory/filename. Would it be possible to provide non-zipped updates? compile) then Run.

ls -l /opt/jenkins_backup insgesamt 229336 rw-r r - 1 tomcat tomcat 204881920 Feb 14 12:13 BACKUPSET_2015-02-13_12-00_.zip rw-r r - 1 tomcat tomcat 4915558 Jun 30 12:01 BACKUPSET_2015-06-29_12-00_.zip rw-r r - 1 Downloading: http://repo1.maven.org/maven2/net/java/dev/jsr-275/jsr-275/1.0-beta-2/jsr-275-1.0-beta-2.pom [INFO] [compiler:compile] [INFO] Compiling 12 source files to http://buildtest.osgeo.org/osgeo/geonetwork/hudson/job/geonetwork-services-ebrim/org.geonetwork$geonetwork-services-ebrim/ws/target/classes [HUDSON] Archiving http://buildtest.osgeo.org/osgeo/geonetwork/hudson/job/geonetwork-services-ebrim/org.geonetwork$geonetwork-services-ebrim/ws/pom.xml to /home/geonetwork/.hudson/jobs/geonetwork-services-ebrim/modules/org.geonetwork$geonetwork-services-ebrim/builds/2009-02-15_12-03-08/archive/org.geonetwork/geonetwork-services-ebrim/3.0.0/pom.xml [INFO] ------------------------------------------------------------------------ [ERROR] BUILD FAILURE [INFO] ------------------------------------------------------------------------ [INFO] Compilation failure http://buildtest.osgeo.org/osgeo/geonetwork/hudson/job/geonetwork-services-ebrim/org.geonetwork$geonetwork-services-ebrim/ws/src/main/java/org/geonetwork/services/ebrim/csw202/CSW202ServiceImpl.java :[29,-1] cannot access org.geonetwork.search.ebrim.SearchEngine SUCCESS [ 2.303 s] [INFO] Californium (Cf) Core .............................. changing location of texmf folder for use across multiple computers (OS X / Apple) What is a real-world metaphor for irrational numbers?

SKIPPED [INFO] Californium (Cf) OSGi Bundle ....................... All associated commit was backported to 1.532.1. Hide Permalink dogfood added a comment - 2014/Jan/15 9:45 AM Integrated in jenkins_main_trunk #3168 [FIXED JENKINS-20345] file descriptor leak in zip file download (Revision f0bbc66921fec56dd9565c2a5146734f20f2fb6c) Result = SUCCESS jonathansternberg : f0bbc66921fec56dd9565c2a5146734f20f2fb6c What are those "sticks" on Jyn Erso's back?