Home > Unable To

unable to validate game version wow

com.sun.deploy.net.faileddownloadexception unable to load resource jnlp

unable to write progress log

fatal error unable to find local grunt. ubuntu

unable to open database file sqlite3

bitsadmin transient_error

registry error loading key 'warcraft iii\installpath' the system cannot find the file specified.

unable to sign into gearbox software shift xbox one

unable to find a service to record with instruments

unable to translate unicode character at index to specified code page

whatsapp failed to download media

starcraft is unable to read a required file windows 7

visual studio unable to copy file access to the path is denied

unable to deploy early bindings biztalk 2010

unable to init 4f

unable to open /var/db/bootcache.playlist hackintosh

unable to print 50 brother printer

brother unable to initialize 8f

unable to clean 4f brother printer

unable to connect to the internet please try again later blackberry 8520

unable to clean 50 brother mfc j220

unable to print 50

unable to clean 5a brother mfc j220

unable to clean 76 brother

machine error 4f

unable to clean 76

brother mfc 5840cn unable to print

unable to clean 51 brother mfc 440cn

unable to init 50 brother dcp-j125

error - unable to set enhanced country code dell

unable to print 4f brother dcp-j315w

brother unable to print 70 error message

unable to send e-mail. contact the site administrator if the problem persists. drupal 7

brother printer unable to print 35

unable to print 51 brother mfc 665cw

unable to print 76 brother mfc-j430w

unable to print 50 brother mfc 440cn

brother printer error 50

unable to init.4f brother printer dcp-j315w

unable to print 50 brother dcp-j125

unable to print 50 brother mfc j430w

brother dcp j315w unable to clean 35

brother mfc-440cn unable to print 50

unable to print 4f brother dcp-j125

brother printer error 46

unable to clean 50 brother

unable to print 50 brother mfc j220

brother machine error 46

print unable 36 brother dcp 7065dn

brother printer unable to print 4f

unable to clean50

brother printer error unable to init 4f

unable to verify account information iphone office 365

unable to locate printer mac

brother printer unable to print 51

brother unable to init. af

unable to init 48

unable to establish connection to host localhost. please check network communication

brother printer mfc 440cn unable to print 51

unable to connect to battle.net diablo 2

rpmdb: unable to join the environment centos

unable to find entrypoint in dll

unable to resolve identifier mplab

visual studio c++ unable to read memory

unable to handle kernel null pointer dereference at (null)

unable to join game session infinite warfare

unable to find assembly version=1.0.0.0 culture=neutral publickeytoken=null'

unable to access jarfile windows 7

brother printer error codes and solution

unable to open iostream.h in turbo c++

unable to write file epson scanner

wsdl exe unable to import operation the element is missing

c# cast parent to child

unable to generate a temporary class (result=1). error cs0030 cannot convert type

unable to initialize punkbuster punkbuster is disabled

unable to cast com object of type 'system.__comobject' to interface type ssis

unable to join game session black ops 2 pc

unable to locate an object compatible with paginate. cakephp

clean unable 46 brother mfc 240c

unable to cast object of type system decimal to type system string linq

system.invalidcastexception: unable to cast object of type

openssl unable to load certificates

busycal unable to connect to google

unable to connect to host mw2 pc

unable to update the dependencies of the project vs2013

unable to send data to printer mac

oraops10.dll download

unable to handle kernel paging request ubuntu

unable to clean 46 brother mfc-440cn

unable to create a constant value of type only primitive types or enumeration types are supported

cam-aaa-0055 user input is required

unable to read manifest 'my project app.manifest'. root element is missing

httpwebrequest.getresponse unable to connect to the remote server

brutus unable to verify target

unable to init 48 brother printer mfc-j220

camstudio 2gb limit

unable to allocate an environment handle odbc

all such servers could be down or disabled by the administrator. (fwm 01014)

unable to start program visual studio 2010 the system cannot find the file specified

regownershipex

unable to translate unicode character c#

unable to handle kernel paging request at virtual address linux

unable to handle kernel paging request at virtual address how to debug

system.dllnotfoundexception unable to load dll the specified module could not be found

camstudio file creation error unable to rename copy

unable to execute file in the temporary directory. setup aborted

could not copy obj debug to bin debug . exceeded retry count of 10. failed

starcraft 2 mass recall unable to open map

print unable 0b

httpwebrequest unable to connect to the remote server c#

unable to find code signing certificate in the current user’s windows certificate store

cannot initialize module treewalker unable to instantiate redundantthrows

jmeterutils unable to get local host ip address

file creation error unable to rename copy audio file camstudio

unable to instantiate 'redundantthrows' class

php warning php startup unable to load dynamic library '/usr/local/lib/php/extensions/

unable to contact your dhcp server. request has timed out

camstudio file creation error unable to rename/copy audio file

unable to find compatible palette format

unable to delete directory netbeans build

java.io.ioexception unable to locate a login configuration

tcpdf error image unable to get image size

unable to get property 'nodetype' of undefined or null reference knockout

the log level has been raised to warn and the output directed to stderr until the problem is fixed.

unable to select twain source canoscan

e: unable to lock directory /var/cache/apt/archives/

convert postscript to pdf mac

camel-spring.jar maven

cas self signed certificate

ruby chromedriver path

clearcase undo checkout from deleted view

failed to deploy ovf package unable to connect to the remote server

unable to tunnel through. proxy returns http/1.1 403 forbidden

javax.naming.namenotfoundexception: while trying to lookup weblogic

unable to find fielddescriptor for in classdescriptor

windows was unable to complete the format internal hard drive

unable to select twain source

windows was unable to connect to wifi windows 7

parcel unable to marshal value arraylist

crmap7009: ccrc command "login" failed: error: "unable to connect to server at

org.hibernate.hibernateexception unable to locate current jta transaction jboss

kernel panic not syncing vfs unable to mount root fs on unknown-block redhat

kernel panic not syncing vfs unable to mount root fs on unknown block 0 0

.drl' cannot be opened because it does not exist

org.omg.corba.marshal: unable to read value from underlying bridge : classnotfoundexception

unable to read package metadata. this may be due to a missing repodata directory

unable to charge your device samsung

pxelinux unable to locate configuration file

fileutils.deletedirectory unable to delete directory

unable to create a checker ant checkstyle

unable to access resume device (label=swap-sda3)

rpm: arguments to --root (-r) must begin with a /

chase quickpay down

we are unable to process your request at this time please try again later

javax.naming.namenotfoundexception unable to resolve jndi

what are locale data files?

unable to open connection to server due to security error

centos 7 kernel panic not syncing vfs

cinema 4d unable to write file mac

centos kernel panic not syncing vfs unable to mount root fs

unable to read group information from repositories. this is a problem with the generation

unable to cast to device chromecast

unable to get class information for

php startup unable to initialize module module compiled with module api

unable to find locale data files please reinstall internet explorer

snagit is unable to start the system audio recording

cast desktop to chromecast

chmod unable to change file mode on read-only file system

plex unable to cast there was a problem playing this item

fsck ext3 unable to resolve label data

checkstyle catchparametername

chmod: unable to change file mode operation not permitted

windows was unable to complete the format dvd rw

ext3 fs unable to read superblock raid

nagios nrpe unable to read output

osx restricted flag

nrpe unable to read output check_nrpe

unable to boot please use a kernel appropriate for your cpu virtualbox

the boot environment variable needs to be set to a bootable image. 3750

fsck.ext3 unable to resolve label

maven-jxr-plugin

no managed connections available within configured blocking timeout

error proxy connection failed android

how to install ncurses library in ubuntu

unable to find a version of the runtime to run this application .net framework

error 51 unable to communicate with the vpn subsystem windows 7

unable to complete request: one or more nodes were unavailable. cqlsh

asterisk died with code 1. automatically restarting asterisk

could not bulk load because ssis file mapping object 'global\dtsqlimport

errors running builder 'checkstyle builder' on project

one user cannot access internet

cisco delete flash directory

unable to read group information from repositories kickstart

unable to cast due to site restrictions fix

fsck.ext3 unable to resolve 'label=/'

unable to bind to locking port 7054 within 45000 ms webdriver

unable to find the sources of your current linux kernel virtualbox guest additions

nrpe unable to read output centos

netapp cifs pdcbroken

unable to launch the vpn gui error code

xdpyinfo unable to open display redhat

unable to launch device manager asa 5505

windows was unable to complete the format dvd

0xc00000a5 adobe reader

unable to resolve the server's dns address google chrome

civ 5 unable to load texture loading base game dds

asdm unable to launch device manager java 8

status_no_logon_servers netapp

unable to stat flash/ no such device

unable to load texture civilization v

windows was unable to complete the disk check xp

event id 1480 citrix

unable to create temp dir flash /update cisco ap

unable to allocate memory after effects

unable to parse command line citrix receiver windows 10

unable to create channel of type 'dahdi' (cause 34 - circuit/channel congestion)

unable to open serial port putty

ucs manager unable to load resource

unable to find a version of the runtime to run this application windows xp

msascui.exe virus

mtr: unable to get raw sockets. mac

cm-req-4159 cognos error

unable to cancel delivery because another operation is trying to complete

unable to launch the vpn gui error code 3

event id 1480 failed to launch application

java io ioexception unable to verify mac at com ibm crypto provider pkcs12keystore engineload

unable to contact albd_server on host

the cas system was unable to initialize wow error

cm-sys-5226

windows was unable to find a certificate xp

cleartool: error: couldn't set view tag clearcase object not found

git unable to create temporary file permission denied

unable to find valid certification path to requested target java

red alert 2 unable to set video mode windows 10

unable to transition to a new state from creating via agentdisconnected

unable to enumerate usb device on port 1 ubuntu

23101 unable to load locale categories

unable to locate have you specified the source directory cobertura

commanderror: unable to serialize database: user matching query does not exist.

citrix connection manager

unable to load authentication library exiting cs source

unable to locate libedit include files

system.net.webexception unable to connect to the remote server c#

unable to select the specified database filename core/loader.php line number 346

unable to instantiate gui defaulting to console mode weblogic

odbcconf configsysdsn parameters

unable to load the requested class library

unable to store job at printer 4250

unable to join network iphone

cannot renew ip address windows 7

the computer is unable to establish two way communication with the device windows 10

unable to find albd_server on host

unable to read package metadata this may be due to a missing repodata directory redhat

startup repair is checking your system for problems loop

unable to connect to your database server using the provided settings in codeigniter

your computer was unable to start startup repair is checking your system for problems

imagemagick convert unable to open image permission denied

com.sun.istack.internal.saxexception2: unable to marshal type

unable to display this web part. to troubleshoot the problem sharepoint 2010

crashplan unable to connect check your network windows 7

unable to find install package joomla 3

cannot locate the internet server or proxy server mac

unable to load page on facebook

unable to stream pdf: headers already sent php

windows unable to start windows 7

imagemagick unable to open image no such file or directory

putty unable to use key file (openssh ssh2 private key)

sickbeard unable to create the folder

windows was unable to connect to wifi

unable to initialize punkbuster. punkbuster is disabled cod4

crashplan unable to connect

soap: call failed: java.io.ioexception: unable to create a socket

samsung smart hub not connecting to server

the game failed to communicate with the authentication server

computer unable to start startup repair

conversion to dalvik format failed unable to execute dex multiple dex files define

unable to download kickstart file http

unable to load the requested class codeigniter

mediawiki error creating thumbnail: unable to save thumbnail to destination

uda-sql-0432 unable to locate the gateway cogudaor

failure sending mail. unable to connect to the remote server c#

imagemagick osx fonts

[aseoledb]client unable to establish a connection

unable to apply drs resource settings on host another task is already in progress

crashplan has been disconnected from the backup engine

unable to connect to the mks could not connect to pipe . pipe vmware-authdpipe within retry period

top xml parsers ver4 msxml4

crashplan unable to connect check your network

what does unable to authenticate mean on pokemon go

unable to load vgcore.dll error code

cmd.exe application error 0xc0000018

connect-msolservice your credentials could not be authenticated. try again

vmware converter v2v unable to obtain hardware information for the selected machine

unable to extend cache no space left on device

sickrage unable to create the folder

unable to connect to internet game

unable to load authentication library exiting half life

unable to connect to the remote server c# web service

unable to load authentication library exiting counter strike source

unable to resolve domain to an ip address

convert: unable to open image no such file or directory

unable to initialize steam. please start from steam client

unable to successfully cleanup cluster in windows 2012 r2

error caused by file /vmfs/volumes/

unable to connect to remote server gmod

unable to connect to wifi windows 7

uda-sql-0432 unable to locate the gateway libcogudaor

unable to send ibec to device

http status 500 - unable to compile class for jsp tomcat

lpq: unable to connect to server

unable to load surface prop file 'scripts surfaceproperties.txt' css

bad rcon password

unable to locate the javac compiler in eclipse maven

crm 2015 unable to load plug-in type

database error (cs) unable to connect to the infostore . (ies 10901)

sharepoint 2013 search unable to connect to the remote server

unable to load manifest file 'scripts/game_sounds_manifest.txt cs go

unable to retrieve the table names for any database

unable to locate printer ubuntu

scripts/surfaceproperties_manifest.txt download

unable to initialize direct3d prototype 2

unable to locate printer cups

uda-sql-0432 unable to locate the gateway cogudaif

unable to authenticate original disc within time limit

unable to start a dcom server windows 10

docker debconf: unable to initialize frontend: dialog

ubuntu + postdrop: warning: unable to look up public/pickup: no such file or directory

git unable to create temporary file

cups unable to encrypt connection

unable to open document please check to see if you have read permission for the above file

unable to initialize device prn powershell

crashplan pro unable to connect to backup engine

unable to browse for active directory objects crm 2015

unable to delete all specified values regedit windows 7

unable to load report 20525 vb6

unable to find the chromedriver executable ruby

alert unable to connect to remote host apache

unable to load plugin type crm 2011

subscription-manager register network error unable to connect to server

unable to apply publish properties for item adodb

currently unable to send your message lg g3

curl: (58) unable to set private key file: type pem

unable to connect to host mw3 teknogods

org.apache.jasper.jasperexception unable to compile class for jsp tomcat 6

unable to open the initial device quitting ghostscript

curl unable to use client certificate (no key found or wrong pass phrase?)

lpstat unable to connect to server linux

openssl unable to load certificates error in pkcs12

lpstat unable to connect to host

curl: (58) unable to load client key 8178

verizon unable to authenticate phone iphone

hexchat unable to verify the first certificate.

git ssl certificate problem: unable to get local issuer certificate

curl pkcs12 client certificate

unable to import binding from namespace wsdl

currently unable to send your message note 5

unable to get cn from peer certificate

curl unable to load client cert -8018

cydia unable to load the certificate for this server is invalid

cydia unable to load a server with the specified hostname

returning ipp client-error-document-format-not-supported for print-job

how to run a jar file in cygwin

unable to connect to the backup engine

unable to load authentication library exiting cs 1.6 portable

svc warning unable to control supervise not running

currently unable to send your message it will be sent when the service becomes available j7

diablo was unable to initialize d3d

unable to get setup from cygwin mirror

unable to access jarfile windows 10

unable to create axisservice for

cygwin unable to connect to x server

system configuration configurationerrorsexception unable to open configsource file

livestream account

xinit unable to connect to x server connection refused cygwin

unable to acquire oracle environment handle python

unable to open berkeley db /etc/sasldb2: no such file or directory

warning in install.packages : internetopenurl failed: ''

cx_oracle.interfaceerror: unable to acquire oracle environment handle linux

ssl certificate problem unable to get local issuer certificate curl

unable to parse package file android

unable to connect to vcenter inventory service 10443 appliance

unable to load cydia the certificate for this server is invalid

git unable to create master.lock permission denied

is skype down

unable to get printer status mac

cydia unable to load untrusted server certificate

unable to execute dex java heap space java heap space eclipse

unable to resolve virtual method android studio

diablo 2 unable to identify version

unable to open database file sqlite

unable to locate package arm-linux-gnueabi-gcc

debian apt-get unable to locate package

unable to acquire oracle environment handle cx_oracle

javax.xml.ws.webserviceexception: unable to create jaxbcontext

unable to open descriptor file to create no such file or directory

unable to connect to the netlogon share error 67

unable to open x server linux

ubuntu unable to locate package update

sudo unable to resolve host hostname

tsql unable to connect: adaptive server is unavailable or does not exist

mirc dcc unable to connect

e unable to locate package kali linux

drush unable to untar

db2 extend tablespace

unable to locate package libapache2-mod-php5

unable to locate package php-fpm ubuntu

unable to fetch some archives maybe run apt-get update or try with fix-missing

unable to clean 5a

unable to open null

fsck.ext4 unable to resolve uuid rhel6

unable to mount root fs on unknown-block(2 0)

curl (58) unable to load client cert 8018

unable to initialize frontend dialog docker

proftpd: warning: unable to determine ip address

dhcpd unable to add forward map from not found

error unable to retrieve usage information

unable to locate package debian 8

unable to connect to the microsoft visual studio remote debugging monitor

configure: error: unable to find libuuid

unable to debug device missing forwarded port

demul bios

demul emulator

dd wrt tftp unable to get responses

dcom was unable to communicate with the computer 10009

unable to cope synonym

unable to fetch some archives maybe run apt-get update kali

unable to connect to libvirt. verify that the 'libvirtd' daemon is running

another word for unable to do something

unable to mount usb drive ubuntu not authorized

unable to connect to the infostore : design studio

starting vmware services virtual machine monitor failed

unable to locate package php5-curl ubuntu

unable to locate printer linux

unable to open berkeley db /etc/sasldb2: permission denied

unable to locate package firmware-b43-installer debian

unable to open supervise/ok access denied

unable to open x display ubuntu

unable to open x display gnome

docker build debconf: unable to initialize frontend: dialog

unable to connect to vnc server using your chosen security setting ubuntu

delphi to

return code: 1, output: nrpe: unable to read output

ora-27123 unable to attach to shared memory segment linux-x86_64 error 13 permission denied

unable to start t sql debugging could not connect to computer

visual studio unable to attach to the process

b43 firmware

install libfaac centos

unable to connect to this network windows 10

unable to add forward map not found

unable to load odbcji32.dll access 2016

dhcpd unable to add forward map from timed out

idl unable to connect to x windows display mac

unable to start services vmware kali linux

apt-get unable to locate package debian

ora-16501

fsck unable to resolve uuid centos

unable to add forward map from not found

unable to launch dentrix chart

dhcp unable to add forward map timed out

unable to add forward map from timed out

unable to open serial port putty windows 7

unable to scan invalid argument

direct3d unable to create device hitman 2

dell server administrator

dhcpd unable to add forward map not found

konica minolta unable to use card

unable to create io-slave klauncher said

xsession unable to start x session ubuntu

direct3d unable to create device freedom fighters

dentrix patient chart error

windows is unable to connect to the selected network windows 7

unable to execute dex java heap space eclipse

how to fix setup was unable to create a new system partition

kega fusion won't go fullscreen

eosinophilic gastrointestinal disease

dhcp "unable to add forward map" "not found"

hitman 2 opengl unable to switch to fullscreen

java sql sqlexception unable to create connection check your url

unable to complete network request to host sql accounting

unable to write to the last block of the device disk utility

psmouse serio1 synaptics unable to query device

javax.xml.ws.webserviceexception unable to create jaxbcontext java 7

unable to create disk image input output error

ora-28545 error diagnosed by net8 when connecting to an agent unable to retrieve text of network/ncr

unable to load workflow actions from server

unable to open database file django

diskeeper license key

warning unable to determine ip address of proftpd

dispatcher initialization failed unable to load configuration. - action - file

operation failed, diagnostics report: cannot open volume: /vmfs/volumes/

django admin unable to open database file

exception starting filter struts2 unable to load configuration. - action

unable to render the file. you probably don't have the correct filters installed

dizzy and trouble focusing eyes

openstack unable to create a new session key. it is likely that the cache is unavailable

unable to open database file android

unable to open database file django apache

unable to write to the last block of the device mac

unable to resolve the server's dns address android

system.dllnotfoundexception c#

 First - 1  - 2  - 3  - 4 - Last